1. 这套Arm技术文档合集到底解决了什么问题
第一次接触Arm架构的人,十有八九会被官方文档的体量和组织方式劝退。打开开发者网站,光是Cortex-A系列就横跨十几代核心,AMBA总线规范从AXI3到AXI5再到CHI,每一版都是几百页的PDF,再加上Mali GPU、CoreSight调试架构、TrustZone安全扩展,文档数量轻松破千。更麻烦的是,这些文档散落在不同入口,有的挂在架构手册下,有的藏在IP产品页里,找一份Cortex-M4的TRM(Technical Reference Manual)可能要翻五六层链接。
这套“Arm技术文档全集合”本质上就是把这些散落的PDF做了一次系统性归拢,按处理器系列、总线协议、体系结构、开发工具几个维度分类打包。它解决的核心痛点很明确:让做底层开发的人不用再花时间找文档,直接按目录定位到需要的那一本。适合的人群包括嵌入式驱动工程师、SoC验证工程师、编译器后端开发者、RTOS移植人员,以及正在准备Arm相关认证或课程考核的学生。哪怕你只是想在Keil里调一个Cortex-M的启动文件,手边有一份准确的TRM和架构参考手册,效率完全不一样。
我自己的习惯是,做任何一块新芯片的bring-up之前,先把对应的TRM、架构参考手册、AMBA协议规范三份文档摆在手边。这套合集的价值就在于,它把这三份东西的获取路径从“到处搜”变成了“一次拿全”。
2. 合集内容架构与核心文档拆解
2.1 处理器系列文档的分布逻辑
合集按Cortex-A、Cortex-M、Cortex-R三条线分开整理,这个分法不是随便定的,而是对应了三种完全不同的应用场景和编程模型。
Cortex-A系列面向应用处理器,文档重点在MMU、缓存一致性、多核启动、虚拟化扩展。比如Cortex-A53和A72的TRM里,缓存层级、ACP(Accelerator Coherency Port)的行为描述是重点,做Linux BSP的人必须啃透。Cortex-M系列面向微控制器,文档核心是NVIC中断控制器、SysTick、低功耗模式、MPU(Memory Protection Unit),做RTOS移植和裸机开发的人看这些最多。Cortex-R系列面向实时安全场景,文档里TCM(Tightly Coupled Memory)、锁步核(Lockstep)、ECC机制是重点,汽车电子和工业控制领域的人离不开。
注意:同一系列不同型号的TRM差异可能很大。比如Cortex-M0和M4的中断优先级寄存器数量就不一样,M0只有2位优先级,M4有3到8位可配置。下载文档时一定要确认型号和修订号(r0p1、r1p0这类后缀),拿错版本会导致寄存器地址对不上。
2.2 AMBA总线文档的关键版本
AMBA是Arm生态里所有IP互联的基础,合集里包含的AMBA规范通常覆盖AXI、AHB、APB三条主线。AXI目前主流是AXI4,分full、lite、stream三种变体;AHB更多用在低带宽外设;APB最简单,基本用于寄存器配置。
做SoC集成的人最需要关注的是AXI的通道握手协议和outstanding transaction机制。AXI有五个独立通道:读地址、读数据、写地址、写数据、写响应。每个通道都是VALID/READY握手,理解这套握手时序是写好interconnect的前提。AXI4还引入了QoS(Quality of Service)信号,多主设备竞争带宽时靠它做优先级仲裁。
| 总线类型 | 典型用途 | 关键特性 | 文档关注点 |
|---|---|---|---|
| AXI4-Full | 高带宽主从互联 | 突发传输、乱序完成 | 握手时序、outstanding深度 |
| AXI4-Lite | 寄存器配置 | 单次传输、无突发 | 地址对齐、响应码 |
| AXI4-Stream | 数据流管道 | 无地址、仅数据 | TLAST/TVALID时序 |
| AHB-Lite | 中低带宽外设 | 流水线、单主 | HREADY反馈、传输类型 |
| APB | 低速寄存器 | 简单两拍传输 | PREADY、PSLVERR |
2.3 体系结构与安全扩展文档
Arm体系结构参考手册(ARM ARM)是整个合集里最“硬”的部分。它不讲具体实现,只讲架构定义:指令集编码、异常模型、内存模型、调试架构。做编译器、模拟器、hypervisor的人必须看这本。比如AArch64的异常级别EL0到EL3的切换规则、PSTATE各字段含义、内存属性Normal/Device的定义,全在这里。
安全扩展方面,TrustZone的文档要配合Cortex-A的TRM一起看。TrustZone把处理器分成Secure和Non-secure两个world,通过SCR寄存器里的NS位切换。实际配置时,TZASC(TrustZone Address Space Controller)和TZPC(TrustZone Protection Controller)的寄存器配置是难点,文档里对每个bit的定义都要逐条核对。
2.4 Mali GPU与Keil开发文档
Mali GPU的文档结构和CPU差别很大,重点在shader core架构、tiler单元、job调度。做图形驱动的人需要看Mali Midgard/Bifrost/Valhall各代的架构说明,理解vertex/tiling/fragment各阶段的分工。Keil这边主要是MDK的编译工具链文档,包括armclang编译器选项、scatter file语法、RTX RTOS API。scatter file是很多人踩坑的地方,加载域和运行域的地址映射写错,程序直接跑飞。
3. 文档使用中的实操方法与关键细节
3.1 如何快速定位一份TRM里的关键信息
拿到一份几百页的TRM,不要从头读。我的做法是先看目录里的“Programmer's Model”章节,这里通常有寄存器映射总表。然后直接跳到“Memory Map”看地址分配,再找“Exception Model”确认异常向量表位置。这三块看完,基本就能开始写启动代码了。
以Cortex-M为例,启动文件里最关键的几个地址:向量表起始地址(通常是0x00000000或重映射后的地址)、初始MSP值(向量表第一个字)、复位向量(第二个字)。这些在TRM的“Exception Model”章节都有明确定义。如果你用的是Keil,启动文件startup_xxx.s里已经填好了,但理解这些值的来源,出问题时才能快速定位。
3.2 AMBA AXI握手时序的实操验证
光看文档里的时序图容易似懂非懂,最好的办法是配合仿真波形看。写一个简单的AXI master模型,发起一次读传输,观察ARVALID和ARREADY的握手过程。关键规则是:VALID一旦拉高就不能撤回,必须等READY拉高完成握手后才能改变。很多新手写的testbench在这里出错,导致仿真挂死。
AXI的outstanding机制也值得实际测一下。配置master支持4个outstanding读事务,连续发起4次读请求,观察RID信号如何区分返回数据属于哪个事务。文档里对ID信号宽度的定义和实际interconnect的实现可能不同,这个差异在调试时经常造成数据错乱。
3.3 Cortex-A多核启动的文档依据
Cortex-A的多核启动流程在TRM和ARM ARM里都有描述,但分散在不同章节。核心步骤是:上电后所有核从同一个复位地址开始执行,通过MPIDR寄存器读取自己的核ID,然后决定谁是primary核(负责初始化系统),谁是secondary核(等待primary核发事件后跳转到指定入口)。
这里有个容易忽略的细节:secondary核在等待时通常执行WFE指令进入低功耗状态,primary核初始化完成后用SEV指令唤醒它们。SEV和WFE的配对使用在ARM ARM的指令集章节有详细说明,但实际写代码时,唤醒地址的传递方式(通常通过一个共享内存变量)文档里不会直接给,需要自己设计。
3.4 Keil scatter file的编写要点
scatter file描述的是代码和数据在内存里的布局。一个典型的scatter file长这样:
LR_IROM1 0x08000000 0x00100000 { ER_IROM1 0x08000000 0x00100000 { *.o (RESET, +First) *(InRoot$$Sections) .ANY (+RO) } RW_IRAM1 0x20000000 0x00020000 { .ANY (+RW +ZI) } }RESET段必须放在最前面,因为向量表要求固定在起始地址。InRoot$$Sections是Keil的库段,不能漏。+RO是只读代码和常量,+RW +ZI是读写数据和零初始化数据。如果芯片有CCM RAM或TCM,可以把堆栈或关键数据单独放到高速区域,写法是在RW_IRAM里再开一个执行域指定地址。
提示:scatter file里的地址必须和芯片实际内存映射一致。拿Cortex-M7举例,DTCM和ITCM的地址通常是0x20000000和0x00000000,但不同厂商可能做偏移。写之前一定翻芯片的数据手册,不要照抄网上的模板。
4. 常见问题排查与避坑经验
4.1 文档版本与芯片实际行为不一致
这是最常见的问题。芯片厂商拿到Arm的IP后可能做定制,比如修改缓存大小、增减调试寄存器。TRM描述的是Arm标准实现,厂商的数据手册才是最终依据。遇到寄存器读写行为异常时,先对照厂商手册确认是否有改动。
排查方法:读芯片的ID寄存器(比如Cortex-M的CPUID,地址0xE000ED00),确认核心型号和修订号,然后找对应版本的TRM。如果厂商手册和TRM冲突,以厂商手册为准。
4.2 AXI传输挂死的定位思路
AXI仿真或实测中传输挂死,九成是握手协议违规。排查顺序:先看VALID是否在READY之前就拉高且一直保持,再看VALID拉高后数据是否稳定不变,最后检查是否有通道之间的依赖死锁(比如master等slave的读数据,slave等master的写地址)。
| 现象 | 可能原因 | 排查手段 |
|---|---|---|
| ARVALID拉高但ARREADY始终为低 | slave未初始化或地址越界 | 检查slave的地址解码逻辑 |
| RVALID有数据但RLAST不拉高 | 突发长度配置错误 | 核对AWLEN/ARLEN与数据量 |
| 写响应BVALID不返回 | 写数据通道未完成握手 | 检查WVALID/WREADY时序 |
| 多主设备时数据错乱 | ID信号位宽不足 | 确认interconnect的ID扩展逻辑 |
4.3 Cortex-M HardFault的文档级排查
HardFault是Cortex-M开发里绕不开的坎。文档里对HardFault的处理流程有完整描述:发生异常时,处理器自动压栈8个寄存器(R0-R3、R12、LR、PC、xPSR),然后跳转到HardFault_Handler。排查时,在Handler里读取压栈的PC值,就能知道是哪条指令触发的。
具体做法:在HardFault_Handler里用汇编取出MSP或PSP的值,然后以这个值为基址偏移0x18读PC。如果用的是Keil,可以在watch窗口里手动算。更高效的方式是写一段C代码,把压栈帧的指针传出来,直接打印PC和LR。这个技巧文档里不会直接教,但理解了自动压栈机制后自然就能推出来。
4.4 Mali GPU文档的阅读顺序
Mali文档不要从API层开始看。正确顺序是:先看硬件架构概述,理解shader core、tiler、L2 cache的关系;再看job manager和调度机制;最后看驱动接口。做性能优化的人重点看tiler的binning策略和shader core的占用率计算。文档里对cycle count的估算有公式,但实际芯片的时钟频率和电压频率调节会影响结果,需要结合实测。
5. 文档管理与高效查阅的个人做法
5.1 本地文档库的目录组织
下载完这套合集后,建议按以下结构整理:
Arm_Docs/ ├── Architecture/ │ ├── ARM_ARM_AArch64.pdf │ ├── ARM_ARM_AArch32.pdf │ └── AMBA_AXI_Protocol.pdf ├── Cortex-A/ │ ├── A53_TRM.pdf │ ├── A72_TRM.pdf │ └── A76_TRM.pdf ├── Cortex-M/ │ ├── M0_TRM.pdf │ ├── M3_TRM.pdf │ ├── M4_TRM.pdf │ └── M7_TRM.pdf ├── Cortex-R/ │ ├── R5_TRM.pdf │ └── R52_TRM.pdf ├── Mali_GPU/ │ ├── Bifrost_Architecture.pdf │ └── Valhall_Architecture.pdf └── Tools/ ├── Keil_MDK_Compiler_Guide.pdf └── Keil_RTX_API_Reference.pdf目录名用英文,避免某些PDF阅读器的路径编码问题。文件名保留型号和文档类型,方便搜索。
5.2 关键词检索技巧
PDF阅读器自带的搜索功能是最常用的,但有几个技巧能提高命中率。搜寄存器名时用全大写,比如SCR、MPIDR;搜功能描述时用文档里的标准术语,比如outstanding transaction、lockstep;搜地址时带上0x前缀。如果一份文档搜不到,换同系列另一份试试,不同文档对同一功能的描述详细程度不同。
5.3 建立自己的速查笔记
文档看多了会发现,真正高频使用的信息就那么几类:寄存器地址、位域定义、异常向量偏移、总线时序参数。我习惯每研究完一个模块,就在笔记里记一张速查表。比如Cortex-M的SCB寄存器块,把CFSR、HFSR、MMFAR、BFAR的地址和关键位记下来,下次调试HardFault直接查笔记,不用再翻几百页的TRM。
这套文档合集最大的价值不是“拥有”,而是“能用起来”。我见过太多人下载了几十个G的PDF,结果每次遇到问题还是靠搜索引擎。真正有效的做法是,针对手头的项目,把相关的三五份文档精读一遍,配合实际代码和仿真验证,把关键细节内化成自己的知识。文档是死的,怎么用它解决实际问题,才是区分新手和老手的地方。