news 2026/10/28 1:04:58

AHB与APB总线深度解析:从MCU内部通信到驱动开发实战

作者头像

张小明

前端开发工程师

1.2k 24
文章封面图
AHB与APB总线深度解析:从MCU内部通信到驱动开发实战

1. 芯片内部到底在聊什么:从一颗MCU的日常说起

很多人第一次接触MCU开发,都是从点灯开始的。写两行代码,编译烧录,LED亮了,觉得不过如此。但如果你把芯片的金属盖揭开,放到显微镜下面看,会发现里面其实是一座微型城市——CPU是市政府,SRAM是临时仓库,Flash是档案馆,各种外设是不同职能的办事窗口。而这座城市里最繁忙的东西,不是数据本身,而是“谁在什么时候把什么数据送到哪里”这件事。

这个“送”的过程,就是总线在干活。

我做了十多年嵌入式,从8位机一路做到多核SoC,越来越觉得:外设驱动写不出来,十有八九不是寄存器没看懂,而是没搞明白数据是怎么在芯片内部流动的。你配置了一个UART,写了波特率,使能了发送,但数据到底是怎么从CPU的寄存器跑到UART的发送缓冲区的?中间经过了谁?谁在仲裁?谁在等待?这些问题不搞清楚,遇到时序问题就只能靠猜。

AMBA就是回答这些问题的答案。它是ARM公司定义的一套片上总线规范,全称Advanced Microcontroller Bus Architecture。你可以把它理解成芯片内部的“交通法规”——规定了谁有路权、怎么变道、红绿灯怎么设。这套规范从1996年第一版到现在,衍生出了AHB、APB、AXI、ACE等一系列协议,覆盖了从低速外设到高性能内存访问的所有场景。

而AHB和APB,是这套体系里最经典的一对搭档。AHB负责“快车道”,接高速设备,比如DMA、外部存储控制器、高速GPIO;APB负责“慢车道”,接低速外设,比如UART、I2C、定时器、看门狗。两者之间通过一个叫Bridge的桥接器连接,快车道上的车要下到慢车道,得先过桥。

这篇文章想做的事情很简单:把AHB和APB之间的“悄悄话”摊开来讲。不是照本宣科念协议手册,而是从实际开发中会遇到的问题出发,讲清楚总线到底怎么工作、为什么这么设计、配置的时候要注意什么、出了问题怎么排查。不管你是刚接触MCU的新手,还是已经写过几年驱动但总觉得“知其然不知其所以然”的老手,应该都能从中找到一些有用的东西。

2. 为什么芯片内部需要总线:一个关于“路”的比喻

2.1 从点对点到总线:芯片内部通信的进化

早期的芯片设计,外设之间的连接是点对点的。CPU要读UART,就拉一根线过去;要读定时器,再拉一根。这种方式在小规模芯片上还能凑合,但外设一多,线就像蜘蛛网一样铺开,面积爆炸,功耗也控制不住。更麻烦的是,每加一个外设,CPU的接口就得改一次,扩展性极差。

总线就是为了解决这个问题出现的。所有设备挂到同一组线上,通过地址来区分谁是谁。CPU只需要一套接口,就能访问所有外设。这就像城市里修了一条主干道,所有商铺都开在路边,快递车沿着路开,看到门牌号就停下来送货。

但总线也带来了新问题:路只有一条,车多了就会堵。于是有了仲裁机制,决定谁先走;有了不同的车道,快车走快车道,慢车走慢车道。AMBA规范里的AHB和APB,就是这种分层思想的产物。

2.2 AHB和APB的分工逻辑

AHB的全称是Advanced High-performance Bus,设计目标是高带宽、低延迟。它支持流水线操作,地址周期和数据周期可以重叠,一个时钟周期就能完成一次传输的地址阶段,下一个周期就能传数据。AHB还支持突发传输,一次地址可以连续传多笔数据,适合DMA这种大批量搬运的场景。

APB的全称是Advanced Peripheral Bus,设计目标正好相反:低功耗、低复杂度。它不支持流水线,一次传输至少需要两个时钟周期,地址和数据是分开的。APB的接口信号很少,外设实现起来简单,功耗也低。UART、I2C这种本身速度就不快的设备,挂在APB上刚刚好。

两者之间的分工,本质上是一个性价比的权衡。如果把UART挂到AHB上,UART本身跑不了那么快,AHB的高带宽就浪费了,而且UART的接口逻辑会变复杂,面积和功耗都上去了。反过来,如果把DMA挂到APB上,APB的带宽又不够,DMA搬数据会被总线拖慢。所以AHB和APB各司其职,通过Bridge连接,形成一个层次化的总线系统。

2.3 一个典型的MCU总线拓扑

以常见的Cortex-M系列MCU为例,典型的拓扑是这样的:CPU核心通过AHB-Lite接口连接到总线矩阵,总线矩阵再分出多条AHB通道,分别接Flash控制器、SRAM控制器、DMA控制器和AHB到APB的Bridge。Bridge下面挂一条APB总线,APB上再挂UART、I2C、SPI、定时器、GPIO等外设。

这个拓扑里,总线矩阵是关键。它允许多个主设备同时访问不同的从设备,比如CPU在访问Flash的同时,DMA在访问SRAM,两者互不干扰。但如果两个主设备同时访问同一个从设备,就需要仲裁了。仲裁的规则通常是固定优先级或者轮询,具体取决于芯片设计。

理解这个拓扑,对写驱动很有帮助。比如你在调试DMA传输时发现数据不对,就可以想一想:DMA走的是AHB通道,它访问的目标是SRAM还是APB上的外设?如果是APB上的外设,那DMA的传输速度会被APB的带宽限制,而且Bridge的仲裁也会影响时序。

3. AHB总线深度拆解:快车道上的规则

3.1 AHB的信号线:谁在说话,谁在听

AHB的信号可以分为几类:全局信号、主设备信号、从设备信号、仲裁信号和解码信号。全局信号包括HCLK和HRESETn,所有设备都接。主设备信号是主设备发出的,包括HADDR地址、HTRANS传输类型、HWRITE读写标志、HSIZE传输大小、HBURST突发类型、HWDATA写数据等。从设备信号是从设备回的,包括HRDATA读数据、HREADY传输完成标志、HRESP响应状态等。

仲裁信号是仲裁器发给主设备的,包括HBUSREQ总线请求、HGRANT总线授权、HLOCK锁定请求等。解码信号是地址解码器产生的,包括HSEL选择信号,用来选中某个从设备。

这些信号里,HREADY和HRESP是最容易出问题的。HREADY表示从设备是否准备好完成当前传输,如果HREADY为低,主设备必须等待。HRESP表示传输是否成功,有OKAY、ERROR、RETRY、SPLIT四种响应。很多人在调试AHB外设时遇到挂死,就是因为从设备没有正确拉高HREADY,或者返回了ERROR但主设备没有处理。

3.2 AHB的传输流程:一个时钟周期里发生了什么

AHB的传输分为两个阶段:地址阶段和数据阶段。地址阶段,主设备把地址和控制信号放到总线上;数据阶段,数据在总线上传输。由于AHB是流水线的,地址阶段和数据阶段可以重叠。也就是说,当前传输的数据阶段,可以和下一个传输的地址阶段同时进行。

这个流水线设计是AHB高性能的关键。举个例子,如果要从SRAM连续读4个字,第一个周期发地址,第二个周期第一个数据回来,同时发第二个地址,第三个周期第二个数据回来,同时发第三个地址,以此类推。理想情况下,每个周期都能完成一笔数据传输。

但流水线也带来了复杂性。如果从设备来不及响应,拉低了HREADY,主设备就必须插入等待周期。等待周期会打断流水线,降低效率。所以AHB从设备的设计目标之一,就是尽量不拉低HREADY,或者至少让等待周期可预测。

3.3 突发传输:一次地址,多笔数据

AHB支持突发传输,这是它和APB最大的区别之一。突发传输的意思是,主设备只发一次地址,然后连续传多笔数据,地址自动递增。突发的长度可以是4拍、8拍、16拍,或者不定长。突发类型有INCR(递增)、WRAP(回绕)、INCR4、INCR8、INCR16等。

突发传输对DMA特别有用。DMA搬一块连续内存时,只需要发一次地址,然后连续读写,效率比每笔都发地址高得多。但突发传输也有坑:如果突发跨越了从设备的边界,从设备可能会返回ERROR。比如一个从设备的地址范围是0x40000000到0x40000FFF,你发了一个16拍的突发,从0x40000FF0开始,那最后几拍就超出了范围,从设备会报错。

注意:配置DMA时,一定要确保突发传输的地址范围在目标从设备的地址空间内。很多DMA控制器的“传输完成但数据不对”问题,都是因为突发越界导致的。

3.4 AHB的仲裁:谁先走,谁等着

AHB支持多个主设备,比如CPU、DMA、以太网MAC等。多个主设备同时请求总线时,仲裁器决定谁先走。仲裁算法可以是固定优先级,也可以是轮询。固定优先级简单,但可能导致低优先级主设备饿死;轮询公平,但实现起来复杂一些。

仲裁的时机是在地址阶段。主设备发HBUSREQ请求总线,仲裁器发HGRANT授权。只有拿到HGRANT的主设备,才能在下一个周期发地址。如果主设备暂时不想释放总线,可以拉高HLOCK,仲裁器就不会把总线授权给其他主设备。

这里有一个实际开发中容易忽略的点:DMA和CPU争总线会导致CPU性能下降。如果DMA长时间占用总线搬大量数据,CPU取指和数据访问都会被延迟,表现为程序运行变慢。解决方法是合理设置DMA的突发长度和优先级,或者用双端口SRAM让CPU和DMA各走各的通道。

4. APB总线深度拆解:慢车道上的智慧

4.1 APB的信号线:极简主义的体现

APB的信号比AHB少得多。全局信号只有PCLK和PRESETn。地址和控制信号包括PADDR、PSEL、PENABLE、PWRITE。数据信号包括PWDATA和PRDATA。响应信号只有PREADY和PSLVERR。

PSEL表示选中某个外设,PENABLE表示传输使能。APB的传输至少需要两个周期:第一个周期PSEL拉高,PENABLE为低,这是Setup阶段;第二个周期PENABLE拉高,这是Access阶段。如果外设需要更多时间,可以拉低PREADY,插入等待周期。

这种两阶段设计看起来效率低,但换来了极简的外设接口。一个APB外设只需要实现几个信号的处理逻辑,面积小,功耗低。对于UART这种本身传输速率就不高的设备,APB的开销完全可以接受。

4.2 APB的传输时序:Setup和Access

APB的传输时序可以用一个简单的状态机来描述。空闲时PSEL和PENABLE都是低。主设备要访问外设时,先把PADDR、PWRITE、PWDATA放好,然后拉高PSEL,进入Setup阶段。下一个周期拉高PENABLE,进入Access阶段。外设看到PSEL和PENABLE同时为高,就知道要进行数据传输了。

如果是写操作,外设在Access阶段采样PWDATA。如果是读操作,外设在Access阶段驱动PRDATA。如果外设还没准备好,可以拉低PREADY,主设备会保持当前状态等待。传输完成后,PSEL和PENABLE都拉低,回到空闲状态。

这里有一个细节:PENABLE只在Access阶段为高,Setup阶段为低。有些新手写APB外设时,看到PSEL为高就开始传输,结果数据错位。正确的做法是等PSEL和PENABLE同时为高,才是真正的传输周期。

4.3 APB Bridge:快慢车道的转换器

APB Bridge是连接AHB和APB的桥梁。它一边是AHB从设备,一边是APB主设备。当CPU通过AHB访问APB外设时,Bridge把AHB的传输转换成APB的传输。

Bridge的工作流程大致是这样的:AHB主设备发地址,Bridge作为AHB从设备接收,然后判断地址是否在自己的APB地址范围内。如果是,Bridge把AHB的读写请求转换成APB的Setup和Access阶段,驱动APB总线完成传输。传输完成后,Bridge把结果返回给AHB主设备。

Bridge的存在,让APB外设不需要关心AHB的复杂协议,只需要实现简单的APB接口。但Bridge也引入了一些延迟。AHB到APB的转换至少需要几个周期,如果APB外设再插入等待周期,总延迟会更大。所以对时序敏感的外设,最好挂在AHB上,而不是APB上。

4.4 APB外设的地址解码

APB总线上可以挂多个外设,每个外设占用一段地址空间。地址解码器根据PADDR的高位产生PSEL信号,选中对应的外设。比如UART的地址范围是0x40000000到0x40000FFF,I2C的地址范围是0x40001000到0x40001FFF,那PADDR的高位不同,PSEL就不同。

地址解码的粒度通常是4KB,因为APB的地址线通常只解码高位,低位直接给外设内部的寄存器用。比如UART的基地址是0x40000000,那UART内部的发送寄存器可能在偏移0x00,接收寄存器在偏移0x04,状态寄存器在偏移0x08。CPU访问0x40000000时,PSEL选中UART,PADDR的低位0x00选中发送寄存器。

提示:写APB外设驱动时,一定要确认外设的地址范围和解码粒度。有些芯片的地址解码粒度不是4KB,而是更小或更大,如果搞错了,访问会落到错误的外设上,表现为读写数据不对或者总线报错。

5. AHB到APB的桥接实战:一次UART写操作的完整旅程

5.1 从CPU到UART:数据经过了哪些站

假设CPU要往UART发送一个字节。CPU执行一条存储指令,地址是UART的发送寄存器,数据是0x55。这条指令在CPU内部经过流水线,最终变成一个AHB写请求。

AHB主设备(可能是CPU的AHB接口)把地址0x40000000放到HADDR上,HWRITE拉高,HTRANS设为NONSEQ,HSIZE设为字节,HWDATA设为0x55。仲裁器授权后,地址阶段开始。地址解码器看到0x40000000,判断这是APB Bridge的地址范围,拉高Bridge的HSEL。

Bridge作为AHB从设备,接收这个写请求。它把AHB的地址和控制信号转换成APB的PADDR、PWRITE、PWDATA,然后拉高PSEL,进入Setup阶段。下一个周期拉高PENABLE,进入Access阶段。UART作为APB从设备,看到PSEL和PENABLE同时为高,采样PWDATA,把0x55写入发送寄存器。如果发送寄存器满,UART拉低PREADY,Bridge就会拉低HREADY,CPU插入等待周期。

传输完成后,Bridge拉低PSEL和PENABLE,返回AHB的HREADY,CPU继续执行下一条指令。

5.2 关键时序参数的计算

这个过程中,有几个时序参数需要关注。首先是AHB到APB的转换延迟。Bridge通常需要2到3个AHB周期来完成转换。如果APB外设再插入等待周期,总延迟会更大。

假设HCLK是100MHz,PCLK也是100MHz(很多MCU的AHB和APB同频),Bridge转换需要3个周期,UART没有等待周期,那一次写操作的总延迟大约是5到6个周期,也就是50到60纳秒。如果UART的波特率是115200,一个字节的传输时间是87微秒,总线的延迟完全可以忽略。

但如果APB外设插入大量等待周期,情况就不一样了。比如某个外设每次访问需要10个等待周期,那总延迟就变成15个周期,150纳秒。如果CPU频繁访问这个外设,性能会明显下降。

注意:选择外设挂载位置时,要评估访问频率和等待周期。高频访问的外设,即使本身速度不快,也建议挂在AHB上,避免Bridge和APB的额外开销。

5.3 实测:用逻辑分析仪看总线波形

如果你有逻辑分析仪,可以把探头接到AHB和APB的关键信号上,直接看波形。我实测过几次,有几个观察值得分享。

第一,AHB的地址阶段和数据阶段确实是重叠的。在波形上,HADDR变化后,下一个周期HWDATA就有效了,同时HADDR已经变成下一个传输的地址。这种流水线设计让AHB的效率很高。

第二,APB的Setup和Access阶段泾渭分明。PSEL拉高后,PENABLE要等一个周期才拉高。如果外设拉低PREADY,PENABLE会保持高,直到PREADY拉高。

第三,Bridge的转换有明显的延迟。AHB的传输结束后,APB的传输还要几个周期才完成。如果CPU连续访问APB外设,AHB会插入等待周期,波形上表现为HREADY周期性拉低。

这些波形观察,对理解总线行为很有帮助。如果你在调试时序问题,强烈建议用逻辑分析仪抓一下波形,比看手册直观得多。

6. 常见问题与排查技巧实录

6.1 总线挂死:HREADY一直为低

这是最常见的问题。现象是CPU访问某个外设时卡死,调试器也连不上。原因通常是从设备没有正确拉高HREADY。可能是外设的时钟没使能,可能是外设的复位没释放,也可能是外设的接口逻辑有bug。

排查方法:先用调试器读外设的时钟使能寄存器和复位寄存器,确认外设已经上电并释放复位。如果外设正常,但HREADY还是低,就用逻辑分析仪抓HREADY信号,看是哪个外设拉低的。如果是APB外设,还要看Bridge的HREADY,因为Bridge会把APB的PREADY转换成AHB的HREADY。

提示:有些MCU的外设时钟默认关闭,访问未使能时钟的外设会导致总线挂死。写驱动时,第一步永远是使能外设时钟。

6.2 数据错位:地址阶段和数据阶段混淆

APB外设的新手常犯的错误,是在Setup阶段就采样数据。正确的做法是等Access阶段,PSEL和PENABLE同时为高时再采样。如果提前采样,读到的可能是上一次传输的残留数据,或者总线上的无效值。

排查方法:用逻辑分析仪抓PSEL、PENABLE、PWDATA、PRDATA的波形,确认数据采样发生在PENABLE为高的周期。如果外设的读数据在Setup阶段就有效,说明外设的接口逻辑有问题。

6.3 突发越界:DMA传输报ERROR

前面提到过,AHB的突发传输如果跨越了从设备的地址边界,从设备会返回ERROR。DMA配置不当是常见原因。比如DMA的源地址是0x20000000,传输长度是1024字节,突发长度是16拍,那DMA会发64次突发。如果SRAM的地址范围是0x20000000到0x2000FFFF,那最后一次突发可能越界。

排查方法:检查DMA的源地址、目标地址和传输长度,确保突发传输的地址范围在从设备的地址空间内。如果不确定,可以把突发长度设小一点,或者用单拍传输。

6.4 性能下降:DMA和CPU争总线

DMA搬大量数据时,CPU性能下降,表现为程序运行变慢、中断响应延迟。原因是DMA和CPU争AHB总线,仲裁器把总线优先给了DMA。

解决方法有几种:一是降低DMA的优先级,让CPU优先访问;二是减小DMA的突发长度,让DMA频繁释放总线;三是用双端口SRAM,让CPU和DMA各走各的通道;四是把DMA的目标外设挂在APB上,这样DMA访问APB外设时,CPU还可以访问AHB上的Flash和SRAM。

注意:仲裁策略是芯片设计决定的,软件通常改不了。但软件可以通过调整DMA的传输参数来间接影响仲裁行为。

6.5 常见问题速查表

问题现象可能原因排查方法解决措施
总线挂死外设时钟未使能读时钟使能寄存器使能外设时钟
总线挂死外设复位未释放读复位寄存器释放外设复位
总线挂死从设备HREADY逻辑错误逻辑分析仪抓HREADY修复从设备逻辑
数据错位APB采样时机错误抓PSEL/PENABLE波形等Access阶段采样
数据错位地址解码错误检查地址范围修正地址解码
DMA报ERROR突发越界检查地址和长度调整突发长度
性能下降DMA争总线观察CPU负载调整DMA优先级或突发长度
读数据不对外设寄存器偏移错误核对手册修正寄存器偏移

7. 从总线视角看MCU选型与开发

7.1 总线架构如何影响MCU选型

选MCU时,很多人只看主频、Flash大小、RAM大小、外设数量。但总线架构同样重要,甚至更重要。一个AHB矩阵设计良好的MCU,CPU和DMA可以并行访问不同从设备,效率比单总线MCU高得多。一个APB桥接设计合理的MCU,外设访问延迟低,中断响应快。

具体怎么看?第一,看AHB矩阵有几条通道。通道越多,并行访问能力越强。第二,看APB有几条。有些MCU有两条APB,低速外设分挂两条,减少单条APB的负载。第三,看DMA的通道数和优先级。DMA通道多、优先级可配,说明总线仲裁设计灵活。

这些信息通常在芯片的数据手册和参考手册里有,但不会直接写“总线架构好”,需要你从框图和总线矩阵描述里自己判断。

7.2 写驱动时如何利用总线知识

写驱动时,总线知识能帮你做几个关键决策。第一,判断外设挂在哪条总线上。如果挂在APB上,访问延迟大,不适合高频轮询。如果挂在AHB上,访问快,但可能和DMA争总线。第二,判断是否需要DMA。如果外设数据量大,用DMA搬数据,CPU可以腾出来做其他事。但DMA会争总线,要权衡。第三,判断中断响应的延迟。中断服务程序如果访问APB外设,延迟会比访问AHB外设大。

这些决策看起来是细节,但在高性能场景下,细节决定成败。我做过一个项目,UART接收用中断处理,每收到一个字节就进中断读寄存器。后来发现CPU负载很高,原因是UART挂在APB上,每次中断读寄存器都要经过Bridge,延迟大。改成DMA接收后,CPU负载降了一半。

7.3 总线调试的常用工具和方法

调试总线问题,最常用的工具是逻辑分析仪和调试器。逻辑分析仪抓波形,调试器读寄存器。两者结合,基本能定位大部分问题。

逻辑分析仪的选择上,采样率要足够高。AHB和APB的时钟通常几十到几百MHz,逻辑分析仪的采样率至少要是时钟频率的4到5倍,才能看清波形细节。探头要接关键信号:HCLK、HRESETn、HADDR、HTRANS、HWRITE、HREADY、HRESP、PSEL、PENABLE、PREADY。

调试器方面,大部分MCU支持JTAG或SWD调试。通过调试器可以读外设寄存器、设置断点、单步执行。如果总线挂死,调试器可能连不上,这时候可以用调试器的“连接下复位”功能,或者用复位引脚强制复位。

提示:调试总线问题时,先确认时钟和复位正常,再看传输时序,最后看数据内容。这个顺序能帮你快速缩小问题范围。

8. 写在最后:一些个人体会

做了这么多年嵌入式,我越来越觉得总线是MCU开发里最被低估的知识点。很多人觉得总线是芯片设计的事,跟写驱动没关系。但实际上,总线的行为直接决定了驱动的性能和稳定性。你写的每一行外设访问代码,背后都是总线在搬运数据。理解总线,就是理解你的代码到底在干什么。

AHB和APB只是AMBA家族里的两个成员,还有AXI、ACE等更复杂的协议。但AHB和APB是最基础的,搞懂了它们,再看其他协议会容易很多。我建议每个嵌入式开发者都花点时间,把AHB和APB的传输时序搞清楚,最好能用逻辑分析仪实际抓一次波形。那种“原来数据是这样流动的”的感觉,比看十遍手册都管用。

最后分享一个小技巧:如果你在调试APB外设时遇到奇怪的问题,先别急着改驱动,用调试器读一下Bridge的寄存器(如果有的话),看看AHB到APB的转换有没有报错。很多问题其实出在Bridge的配置上,而不是外设本身。这个技巧帮我省过不少时间,希望对你也有用。

版权声明: 本文来自互联网用户投稿,该文观点仅代表作者本人,不代表本站立场。本站仅提供信息存储空间服务,不拥有所有权,不承担相关法律责任。如若内容造成侵权/违法违规/事实不符,请联系邮箱:809451989@qq.com进行投诉反馈,一经查实,立即删除!
网站建设 2026/10/28 1:04:48

STM32F1实战:手写DHT11温湿度驱动与单总线时序解析

/* MD / 富文本中的 .toc(含博客园搬家等嵌套结构);.toc-box 在侧栏,不受影响 */#content_views .toc,/* 编辑器常在目录前后插入空 p(:empty 仍占 20px),一并去掉避免顶空隙 */#content_views.markdown_views > p:empty:has(+ .toc),#content_views.markdown_views …

作者头像 李华
网站建设 2026/10/28 1:04:42

纯前端 HTML+JS 扫码插件:摄像头识别条形码与二维码

/* MD / 富文本中的 .toc(含博客园搬家等嵌套结构);.toc-box 在侧栏,不受影响 */#content_views .toc,/* 编辑器常在目录前后插入空 p(:empty 仍占 20px),一并去掉避免顶空隙 */#content_views.markdown_views > p:empty:has(+ .toc),#content_views.markdown_views …

作者头像 李华
网站建设 2026/10/28 1:03:47

瑞萨RA4M2与DA14531蓝牙透传方案:UART协议设计与双向通信实战

/* MD / 富文本中的 .toc(含博客园搬家等嵌套结构);.toc-box 在侧栏,不受影响 */#content_views .toc,/* 编辑器常在目录前后插入空 p(:empty 仍占 20px),一并去掉避免顶空隙 */#content_views.markdown_views > p:empty:has(+ .toc),#content_views.markdown_views …

作者头像 李华
网站建设 2026/10/28 1:03:43

电赛6天5夜全攻略:时间规划、方案取舍与联调避坑指南

/* MD / 富文本中的 .toc(含博客园搬家等嵌套结构);.toc-box 在侧栏,不受影响 */#content_views .toc,/* 编辑器常在目录前后插入空 p(:empty 仍占 20px),一并去掉避免顶空隙 */#content_views.markdown_views > p:empty:has(+ .toc),#content_views.markdown_views …

作者头像 李华
网站建设 2026/10/28 1:03:43

STM32F1标准库+EC200S接入华为云MQTT实战指南

/* MD / 富文本中的 .toc(含博客园搬家等嵌套结构);.toc-box 在侧栏,不受影响 */#content_views .toc,/* 编辑器常在目录前后插入空 p(:empty 仍占 20px),一并去掉避免顶空隙 */#content_views.markdown_views > p:empty:has(+ .toc),#content_views.markdown_views …

作者头像 李华
网站建设 2026/10/28 1:03:11

毕业设计全流程避坑指南:选题、技术栈与答辩核心方法论

/* MD / 富文本中的 .toc(含博客园搬家等嵌套结构);.toc-box 在侧栏,不受影响 */#content_views .toc,/* 编辑器常在目录前后插入空 p(:empty 仍占 20px),一并去掉避免顶空隙 */#content_views.markdown_views > p:empty:has(+ .toc),#content_views.markdown_views …

作者头像 李华