1. 为什么想到用 AI 来辅助搭建 AXI4 VIP
做数字芯片验证的人,对 AXI4 这套协议可以说是又爱又恨。爱的是它足够通用,几乎所有的 SoC 内部互联、DDR 控制器、DMA、外设桥接都绕不开它;恨的是它的协议细节实在太多——五条独立通道、乱序返回、Outstanding 事务、写响应依赖、AxLEN/AxSIZE/AxBURST 的组合约束、4KB 边界规则、窄传输的 strobe 处理,随便拎一条出来都够写一整天。
传统做法是找一份现成的 VIP 拿来用,或者团队里有人手撸一套。但现实情况往往是:商用的太贵,开源的要么功能残缺要么风格不合口味,自己写的又很难做到可复用——换个项目、换个验证环境,就得大改一遍。我见过太多团队,每个项目都重新写一遍 AXI4 的 driver 和 monitor,写完就扔,下一个项目再重来。这本质上不是技术问题,而是工程资产化的问题。
这两年 AI 辅助编程的能力提升非常明显,尤其是对协议类、模板类、结构高度规整的代码,AI 的生成质量已经相当能打。我就在想:能不能把 AXI4 VIP 的开发过程,从"每次手写"变成"AI 辅助生成 + 人工精修 + 沉淀为可复用资产"?这个想法落地之后,效果比我预期的好很多。这篇文章就把我完整的思路、踩过的坑、以及最终沉淀下来的方法论分享出来,适合正在做 UVM 验证环境搭建、或者想把手头验证代码资产化的朋友参考。
核心关键词就几个:AI 辅助、AXI4、VIP、UVM、验证代码复用。下面我会从整体设计、核心细节、实操过程、问题排查四个维度展开,尽量把每一步的"为什么"讲清楚。
2. 整体设计思路:把 VIP 拆成"可生成"和"必须手写"两部分
2.1 先想清楚 VIP 到底由哪些东西组成
一套完整的 AXI4 VIP,从 UVM 的角度拆开,大致是这么几块:
- Transaction(sequence_item):描述一次 AXI 事务的所有字段,包括 addr、len、size、burst、id、wstrb、data、resp 等。
- Sequencer:负责仲裁和分发 sequence。
- Driver:把 transaction 翻译成引脚级信号时序,驱动到 DUT。
- Monitor:采样引脚信号,还原成 transaction,送给 scoreboard 和 coverage。
- Agent:把上面几个组件打包,配置成 active 或 passive。
- Config:参数化配置,比如数据位宽、地址位宽、ID 位宽、是否支持乱序等。
- Coverage:功能覆盖率模型,覆盖各种 burst 类型、边界情况。
- Scoreboard / Reference Model:可选,取决于验证场景。
这里面,Transaction、Config、Agent 的骨架、Coverage 的 bin 定义,都是高度模板化、结构规整的代码,非常适合 AI 生成。而Driver 的时序逻辑、Monitor 的采样时机、乱序处理的仲裁逻辑,这些涉及具体协议时序和边界判断的部分,AI 生成的质量参差不齐,必须人工精修。
所以我的整体策略是:AI 负责"骨架和样板",人负责"时序和边界"。这个分工是整套方法论的核心。
2.2 为什么不让 AI 一把梭全生成
我一开始也试过直接让 AI 生成整个 VIP,结果很典型:Transaction 写得像模像样,Driver 的时序却错得离谱——比如把 AW 和 W 通道的握手顺序搞反,或者漏掉了 WLAST 的判断,或者对 AxSIZE 和 WSTRB 的对应关系处理错误。这些错误在编译阶段完全看不出来,只有跑仿真才会暴露,而且往往是很隐蔽的时序问题。
原因其实不难理解:AI 对协议的理解是"统计意义上"的,它见过大量 AXI 代码,知道大概长什么样,但对"为什么这个信号必须在这个时钟沿采样"这种时序因果,它没有真正的推理能力。所以凡是涉及"时序因果"和"边界条件"的代码,必须人来把关。
反过来,像 Transaction 的字段定义、Config 的参数列表、Agent 的 build/connect 骨架,这些是"结构性的",AI 生成得又快又准,人只需要检查字段是否齐全、命名是否规范即可。
2.3 资产化的关键:接口稳定 + 参数化 + 文档
VIP 要成为"可复用的工程资产",光能跑还不够,得满足三个条件:
- 接口稳定:对外暴露的 API 不能随便变,否则每个项目都要改调用方。
- 参数化充分:数据位宽、地址位宽、ID 位宽、Outstanding 深度这些,必须能通过参数配置,而不是写死。
- 文档齐全:每个参数什么意思、每个 sequence 怎么用、覆盖率怎么收集,都得写清楚。
AI 在这三件事上都能帮上忙——尤其是文档,让 AI 根据代码自动生成注释和 README,效率极高。我后面会专门讲怎么用 AI 生成高质量的 VIP 文档。
3. 核心细节解析:AI 生成 VIP 代码的实操要点
3.1 Transaction 的字段设计:别漏了这些坑
Transaction 看起来简单,其实坑不少。我列一下 AXI4 事务必须包含的字段,以及每个字段的注意事项:
| 字段 | 含义 | 常见坑 |
|---|---|---|
| addr | 起始地址 | 要检查 4KB 边界,跨边界要拆分成多个事务 |
| len | burst 长度 | AXI4 是 1-256,编码时是 len-1,别搞错 |
| size | 每拍字节数 | 2^size,要和 data 位宽匹配 |
| burst | burst 类型 | FIXED/INCR/WRAP,WRAP 的地址回绕逻辑最容易错 |
| id | 事务 ID | 乱序返回靠它区分,位宽要参数化 |
| wstrb | 写 strobe | 窄传输时只有部分字节有效,要和 size 对应 |
| data | 数据 | 位宽参数化,注意大小端 |
| resp | 响应 | OKAY/EXOKAY/SLVERR/DECERR |
让 AI 生成 Transaction 的时候,提示词里一定要把这些字段和约束写清楚。我常用的提示词模板是这样的:
请生成一个 UVM sequence_item,用于描述 AXI4 事务,要求: 1. 字段包括 addr, len, size, burst, id, wstrb, data, resp 2. 所有位宽通过 parameter 参数化:ADDR_WIDTH, DATA_WIDTH, ID_WIDTH 3. len 字段用 8 位,实际长度是 len+1 4. 添加 UVM 字段自动化宏 `uvm_field_int 5. 添加约束:addr 不能跨 4KB 边界 6. 添加一个 function 计算实际字节数这样生成的代码,基本可以直接用,人只需要微调约束和边界检查。
3.2 Driver 的时序逻辑:AI 生成后必须人工核对的三处
Driver 是 AI 最容易出错的地方。我总结了三处必须人工核对的点:
第一处:五通道的握手独立性。AXI4 的 AW、W、B、AR、R 五条通道是独立握手的,AI 经常把它们写成"顺序执行",比如先等 AW 握手再发 W,这就错了。正确做法是 AW 和 W 可以并行发送,B 通道在 W 最后一拍之后才可能返回。
第二处:WLAST 的判断。写通道的最后一拍必须拉高 WLAST,AI 有时候会漏掉,或者判断条件写错(比如用 len 而不是实际计数)。
第三处:读通道的 RLAST 和乱序。读返回可能乱序,RLAST 标志一次 burst 的结束,AI 经常把 RLAST 和"最后一个 beat"的计数搞混。
我的做法是:让 AI 生成 Driver 的骨架,然后自己把这三处的时序逻辑重写一遍。骨架部分(比如时钟沿驱动、复位处理、mailbox 通信)AI 写得很好,可以放心用。
3.3 Monitor 的采样:为什么必须用 clocking block
Monitor 的核心是"在正确的时机采样正确的信号"。这里有个 UVM 验证的经典坑:绝对不要在 monitor 里直接用 @(posedge clk) 采样,要用 clocking block。
原因是 clocking block 会自动处理采样偏移(skew),避免竞争冒险。AI 生成 monitor 的时候,如果不特别说明,它经常直接写 @(posedge clk),这在简单场景下能跑,但一旦 DUT 的信号有延迟,采样就会出错。
所以我的提示词里一定会加一句:"Monitor 采样必须使用 clocking block,采样偏移设置为 1step。"这样生成的代码就规范多了。
3.4 Coverage 的 bin 定义:让 AI 帮你穷举边界
功能覆盖率是 VIP 资产化的重要一环。AXI4 的覆盖率模型要考虑的组合非常多:burst 类型 × size × len 范围 × 地址对齐情况 × 响应类型。人工穷举很累,但 AI 很擅长这种"组合枚举"的活。
我一般让 AI 先生成一版覆盖率模型,然后自己检查是否有遗漏。比如 WRAP burst 的地址回绕、窄传输的 strobe 组合、4KB 边界附近的事务,这些都是容易漏的 bin。
4. 实操过程:从零搭建一套可复用的 AXI4 VIP
4.1 环境准备与目录结构
先说环境。我用的是标准的 UVM 1.2 + 主流仿真器,目录结构是这样的:
axi4_vip/ ├── src/ │ ├── axi4_pkg.sv │ ├── axi4_if.sv │ ├── axi4_transaction.sv │ ├── axi4_config.sv │ ├── axi4_driver.sv │ ├── axi4_monitor.sv │ ├── axi4_sequencer.sv │ ├── axi4_agent.sv │ ├── axi4_coverage.sv │ └── axi4_seq_lib.sv ├── doc/ │ └── README.md └── test/ └── axi4_smoke_test.sv这个结构是让 AI 帮我定的,我提的要求是"符合 UVM 标准、便于参数化、便于扩展"。AI 给的方案基本合理,我只调整了 sequence library 的拆分方式。
4.2 用 AI 生成 Transaction 和 Config
Transaction 的生成我前面讲了提示词模板,这里补充一个细节:字段自动化宏的选择。uvm_field_int和uvm_field_array_int各有适用场景,data 数组用 array 版本,其他标量用 int 版本。AI 有时候会统一用 int,导致数组字段的 compare 和 copy 出问题。
Config 类的关键是参数化。我让 AI 生成的 config 包含这些参数:
class axi4_config extends uvm_object; int ADDR_WIDTH = 32; int DATA_WIDTH = 64; int ID_WIDTH = 4; int MAX_OUTSTANDING = 8; bit HAS_COVERAGE = 1; bit IS_ACTIVE = 1; // ... endclass这些参数通过uvm_config_db传递,agent 在 build 阶段读取。AI 生成的骨架没问题,我补充了参数合法性检查(比如 DATA_WIDTH 必须是 8 的倍数)。
4.3 Driver 的人工精修:以写通道为例
Driver 的写通道逻辑,我最终手写的版本大致是这样的思路(伪代码):
// AW 和 W 通道并行处理 fork // AW 通道 forever begin seq_item_port.get_next_item(req); drive_aw(req); // 等待 AW 握手完成 end // W 通道 forever begin // 根据 req 的 len 和 size 逐拍发送 for (int i = 0; i <= req.len; i++) begin drive_w_beat(req, i); if (i == req.len) wlast <= 1; end end join // B 通道单独处理这里的关键是 AW 和 W 用 fork-join 并行,B 通道独立等待。AI 生成的版本把三者写成顺序的,我全部重写了。
4.4 Monitor 的采样与 transaction 还原
Monitor 要做两件事:采样信号、还原 transaction。采样用 clocking block,还原的时候要注意把同一 ID 的读返回拼成一个完整的 burst。
我让 AI 生成的 monitor 骨架里,有一个collect_transaction的 task,逻辑是:检测到 AR 握手后,记录地址和 ID,然后等 R 通道返回,按 ID 匹配,直到 RLAST 拉高,拼成完整 transaction。这个逻辑 AI 写得基本对,我补充了乱序场景下的 ID 匹配队列。
4.5 用 AI 生成 VIP 文档
代码写完之后,我让 AI 根据源码自动生成 README。提示词是:
请根据以下 SystemVerilog 代码,生成一份 VIP 使用文档,包括: 1. VIP 功能概述 2. 参数配置说明(每个参数的含义、取值范围、默认值) 3. 常用 sequence 的使用示例 4. 覆盖率模型说明 5. 已知限制生成的文档质量出乎意料地好,尤其是参数说明部分,AI 把每个参数的含义都解释得很清楚。我只需要补充一些"使用注意事项"和"踩坑记录"。
5. 常见问题与排查技巧实录
5.1 AI 生成代码的典型问题速查表
| 问题现象 | 根本原因 | 解决方法 |
|---|---|---|
| 仿真挂死,无 transaction | Driver 握手顺序错误 | 检查五通道是否独立并行 |
| 读数据错位 | Monitor 采样时机不对 | 改用 clocking block,偏移 1step |
| 覆盖率收不满 | bin 定义遗漏边界 | 补充 WRAP、窄传输、4KB 边界 bin |
| 编译报错,字段未定义 | AI 漏生成字段 | 对照协议字段表逐一核对 |
| 乱序场景失败 | ID 匹配逻辑缺失 | 补充 ID 队列和乱序仲裁 |
| 窄传输数据错误 | WSTRB 与 SIZE 不对应 | 检查 strobe 生成逻辑 |
5.2 几个我踩过的坑
坑一:AI 生成的约束太宽松。比如 addr 跨 4KB 边界的约束,AI 经常写成addr % 4096 + len * size <= 4096,但实际应该是(addr % 4096) + (len+1) * (1<<size) <= 4096。差一个 len+1 和 1<<size,就会漏掉边界情况。
坑二:AI 对 WRAP burst 的理解经常出错。WRAP burst 的地址回绕逻辑比较绕,AI 生成的版本有时候会把回绕点算错。我的做法是手写一个calc_wrap_addr函数,然后让 AI 根据这个函数生成测试用例。
坑三:覆盖率模型的 cross 太多导致仿真变慢。AI 很喜欢生成大量的 cross bin,看起来很全面,但实际跑起来覆盖率收集会拖慢仿真。我的经验是:只 cross 真正有意义的组合,比如 burst 类型 × size,而不是所有字段两两 cross。
5.3 让 AI 辅助调试的思路
除了生成代码,AI 在调试阶段也很有用。我常用的一个技巧是:把仿真日志里的错误信息贴给 AI,让它分析可能的原因。比如日志里出现 "UVM_FATAL: RLAST not asserted at end of burst",AI 通常能快速定位到是 monitor 的 RLAST 判断逻辑有问题。
不过要注意,AI 的分析是"概率性"的,它给的几个可能原因里,需要你自己判断哪个最可能。我的做法是让 AI 列出 3-5 个可能原因,然后按可能性排序,逐个排查。
6. 资产化落地:让 VIP 真正可复用
6.1 接口稳定性的保障
VIP 要复用,接口就不能随便变。我的做法是:对外只暴露 agent 和 config,内部组件(driver、monitor)不直接对外。所有配置通过 config 对象传递,所有激励通过 sequence 产生。这样即使内部实现改了,调用方也不用动。
AI 在生成 agent 的时候,我特意让它把内部组件声明为 local 或 protected,只暴露必要的 API。
6.2 参数化的边界
参数化不是越多越好。我见过有人把 AXI4 VIP 参数化到"支持任意通道数",结果代码复杂度爆炸,维护成本极高。我的经验是:只参数化真正会变的,比如位宽、深度、ID 宽度。像通道数这种 AXI4 固定的(就是 5 条),没必要参数化。
6.3 版本管理与回归
VIP 作为资产,必须有版本管理和回归测试。我用 git 管理代码,每次修改都跑一遍 smoke test 和回归用例。AI 帮我生成了回归脚本的骨架,我补充了覆盖率收集和报告生成的部分。
6.4 文档与知识沉淀
最后一点,也是最重要的:把踩过的坑写进文档。AI 生成的文档是"标准文档",但真正有价值的是"经验文档"——哪些参数组合会出问题、哪些场景覆盖率收不满、哪些时序需要特别注意。这些是 AI 生成不出来的,必须人工沉淀。
我现在的做法是,每解决一个 bug,就在 README 的"Known Issues"章节加一条记录。时间长了,这份文档就成了团队里最有价值的资产。
7. 我个人的一些体会
这套"AI 辅助 + 人工精修 + 资产化沉淀"的方法,我用下来最大的感受是:AI 把重复劳动的时间省下来了,但核心的协议理解和时序推理,还是得靠人。它不是一个"输入标题就出成品"的魔法,而是一个"放大你效率"的工具。
具体来说,Transaction、Config、Agent 骨架、Coverage bin、文档这些,AI 能帮你省 70% 以上的时间;但 Driver 时序、Monitor 采样、乱序仲裁这些,AI 只能帮你搭骨架,核心逻辑还得自己写。把这两部分分清楚,整个开发流程就顺了。
另外一个小技巧:让 AI 生成代码的时候,一定要给它具体的协议约束和边界条件,而不是笼统地说"生成一个 AXI4 VIP"。提示词越具体,生成质量越高。我前面给的提示词模板,你可以直接拿去改。
最后,VIP 资产化的关键不在于代码写得多漂亮,而在于接口稳定、参数清晰、文档齐全、坑都记录在案。这四点做到了,这套 VIP 就能在多个项目之间真正复用起来,而不是每个项目重写一遍。