news 2026/11/3 21:10:07

8通道PCIe-QDMA/RDMA子系统:高并发视频采集的确定性DMA方案

作者头像

张小明

前端开发工程师

1.2k 24
文章封面图
8通道PCIe-QDMA/RDMA子系统:高并发视频采集的确定性DMA方案

简介:本资源是一份面向FPGA开发工程师与高速接口设计人员的PCIe多通道DMA控制器IP技术手册,聚焦8通道SGDMA/QDMA/RDMA/CDMA四类核心数据搬运方案,解决高性能、低延迟PCIe外设数据吞吐瓶颈问题。手册详细阐述基于Xilinx Ultrascale+/7 Series平台的Multi-Channel PCIe QDMA&RDMA Subsystem架构,覆盖DMA地址队列与Ring缓冲双模式、8路独立H2C/C2H通道、AXI4-Stream/FIFO用户接口、MSI中断机制及视频采集/显示等典型应用场景。资源为单个PDF文件,大小278KB,内容精炼但信息密度高,含性能实测数据(如PCIe 3.0 x16下双向DMA超14GB/s)、寄存器映射说明、系统框图与应用拓扑图。目前已有842人学习下载,读者可直接获取完整IP特性清单、硬件接口定义、配置参数建议及驱动集成要点,是开展PCIe加速卡、智能网卡或视频采集卡FPGA逻辑开发的重要参考依据。

1. 为什么8通道PCIe-QDMA/RDMA子系统不是“堆参数”,而是视频采集与实时回传场景下的刚需落地方案

你有没有遇到过这样的翻车现场:FPGA板卡接了8路MIPI摄像头,每路1080p60,总带宽逼近12GB/s,Linux驱动一开DMA就掉帧、中断延迟抖动超200μs、V4L2应用频繁报-EIO、用户态缓冲区像黑匣子一样无法预知何时就绪?这不是代码写错了,是DMA架构选型错了——用传统单通道SGDMA硬扛多源异步流,等于让一辆皮卡拉八辆集装箱货车。而这份8通道PCIe-QDMA&RDMA IP手册,本质是一套为高并发、低抖动、确定性时序场景量身定制的硬件级数据搬运协议栈。它不讲“支持PCIe 4.0”这种虚话,而是明确告诉你:在x16链路上,8个H2C通道可并行吞吐14GB/s以上,每个通道独立维护32深地址队列+可配深度Ring缓冲,且C2H路径实测抖动<500ns。适合谁?正在做8K视频拼接卡、多光谱遥感载荷地面站、工业视觉AOI检测平台的FPGA工程师;也适合要交毕设/课设的学生——因为交付包里含完整Linux V4L2驱动、AXI4-Stream接口时序约束、8通道资源占用表(精确到LUT/FF/BRAM),你照着例化、改地址、连中断,就能跑通真实视频流。这不是IP核说明书,这是一份能直接焊进你板子、上电即用的工程契约。

2. 总体架构设计:三层解耦结构与四类DMA引擎的职责划分

这套Multi-Channel PCIe QDMA&RDMA Subsystem不是把一堆DMA模块简单拼起来,而是按“控制面-数据面-接口面”做了严格分层。最底层是Xilinx Integrated Block for PCIe(Endpoint模式),中间是DMA子系统核心,最上层是面向用户逻辑的AXI4-Stream/FIFO接口。关键在于:所有8个H2C和8个C2H通道完全物理隔离,没有共享仲裁器、没有共用描述符解析器——这才是实现90%+ DMA效率和超低抖动的底层保障。下面拆解四个核心引擎模块的设计逻辑。

2.1 QDMA引擎:基于地址队列的确定性传输控制器

QDMA(Queue-based DMA)引擎专为需要强时序可控性的场景设计,比如视频显示同步。它不依赖软件轮询,而是由硬件自动从Host内存中按FIFO顺序取描述符(Descriptor),每个描述符包含源地址、目的地址、长度(最大4GB)、完成中断使能位。典型配置如下:

// QDMA通道0描述符结构(64-bit对齐,共4个DWORD) // [63:32] : Source Address (64-bit) // [31:0] : Length (32-bit, max 0xFFFFFFFF) // [127:96]: Destination Address (64-bit) // [95:64] : Reserved + Interrupt Enable Bit

提示:描述符必须64字节对齐,且Host端需保证Cache一致性(Linux下用dma_alloc_coherent分配)。若用malloc+mmap,大概率出现地址错乱——这是学生项目里最高频的玄学问题。

该引擎支持两种工作模式:

  • Interrupt Mode:每个描述符完成后触发MSI中断,Host通过读取C2H_Complete_Status[0]寄存器确认;
  • Polling Mode:Host周期性查询C2H_Descriptor_Done标志位,适用于对中断延迟敏感但CPU资源充裕的场景。
    我一般会强制在视频采集启动前,先用Polling Mode校验前10个描述符是否被正确加载,再切到Interrupt Mode——这步省掉,后面调试中断丢失能让你熬三个通宵。

2.2 RDMA引擎:Ring Buffer驱动的超低抖动数据管道

RDMA(Ring-based DMA)引擎解决的是持续流式数据的零拷贝搬运问题,典型如网络包收发、传感器连续采样。它抛弃了QDMA的“一次一描述符”模型,改用环形缓冲区(Ring Buffer):Host预先分配一块连续内存,划分为N个固定大小Slot(如每个Slot 64KB),RDMA引擎按生产者-消费者模型自动循环填充/消费。关键参数配置在RDMA_CTRL寄存器:

寄存器偏移字段说明典型值
0x000RING_BASE_ADDR_L/HRing起始地址低/高32位0x8000_0000
0x008RING_SIZESlot总数(2的幂)256
0x00CSLOT_SIZE每个Slot字节数65536
0x010PRODUCER_IDXHost写入位置索引动态更新
0x014CONSUMER_IDXRDMA读取位置索引硬件自动更新

注意:PRODUCER_IDX和CONSUMER_IDX都是只写/只读寄存器,绝不能用同一变量缓存。某次调试中A同学把PRODUCER_IDX读出来再加1写回去,结果因两次PCIe TLP间隔导致索引错位,Ring直接死锁——后来我们改成每次写前先读CONSUMER_IDX,确保差值不超过RING_SIZE-1。

RDMA的超低抖动来自两点:一是Ring Buffer避免了描述符解析开销(每个Slot只需更新索引);二是硬件内置预取机制,当CONSUMER_IDX指向Slot N时,已提前将Slot N+1的地址加载进内部缓冲。实测PCIe 3.0 x16下,从Host写入PRODUCER_IDX到FPGA侧AXI4-Stream发出第一个有效tvalid,稳定在83ns±12ns。

2.3 CDMA引擎:连续块搬运的吞吐压榨器

CDMA(Continuous DMA)引擎是纯暴力带宽型选手,适用于大块内存拷贝,比如DDR间搬移AI模型权重、FPGA配置镜像加载。它不处理描述符,只认三个参数:SRC_ADDR、DST_ADDR、LENGTH。启动流程极简:

// Linux驱动中启动CDMA通道0(伪代码) iowrite32(0x80000000, cdma_base + CDMA_SRC_ADDR_L); // 源地址低32位 iowrite32(0x00000000, cdma_base + CDMA_SRC_ADDR_H); // 源地址高32位 iowrite32(0x90000000, cdma_base + CDMA_DST_ADDR_L); // 目的地址低32位 iowrite32(0x00000000, cdma_base + CDMA_DST_ADDR_H); // 目的地址高32位 iowrite32(0x00400000, cdma_base + CDMA_LENGTH); // 搬运4MB iowrite32(0x1, cdma_base + CDMA_START); // 写1启动

关键设计点在于Max Payload Size(MPS)和Max Read Request Size(MRRS)的协同。手册明确要求MPS=256B、MRRS=512B,这是因为CDMA引擎内部采用“乒乓请求”策略:当一个TLP请求发出后,立即准备下一个地址,避免PCIe链路空闲。若MRRS设为128B,实测吞吐直接跌40%——这不是理论值,是我们在Ultrascale+板卡上用逻辑分析仪抓波形验证过的血泪经验。

2.4 AXI4-Lite Master配置总线:绕过DMA的直连控制通道

这个常被忽略的模块,其实是调试和应急操作的生命线。AXI4-Lite Master接口允许Host CPU直接读写FPGA用户逻辑寄存器,完全不经过DMA引擎。典型用途包括:

  • 在DMA未启动前,初始化Camera Link接收器的PHY参数;
  • 当某路H2C通道异常时,直接读取该通道的ERROR_STATUS寄存器(地址0x2000+channel_id*0x100);
  • 触发硬件复位:向GLOBAL_RESET寄存器(0x1000)写0xAAAA_BBBB。

提示:该接口是32-bit固定宽度,所有寄存器地址必须4字节对齐。曾有学生把SPI配置寄存器映射到0x3001,结果读出来全是0——查了两天才发现地址没对齐,硬件自动截断了低两位。

3. 关键模块实现:AXI4-Stream接口时序与8通道中断聚合策略

AXI4-Stream是连接DMA引擎与用户逻辑的唯一数据通路,其时序健壮性直接决定整个系统的稳定性。而8通道带来的中断风暴,必须用硬件聚合来化解。这两点,是方案能否从Demo走向量产的核心分水岭。

3.1 AXI4-Stream接口:tready/tvalid握手背后的隐性约束

每个DMA通道对应独立的AXI4-Stream接口(H2C_Read和C2H_Write),信号定义严格遵循AXI4-Stream协议,但有三点极易踩坑的隐性约束:

  1. tvalid必须与数据严格同步:FPGA侧生成tvalid的时钟沿,必须与tdata建立时间(setup time)满足时序要求。在Ultrascale+器件中,若tdata来自Block RAM输出,需插入一级寄存器打拍,否则综合工具可能将tvalid路径优化成组合逻辑,导致建立时间违例。实测在156.25MHz(PCIe 3.0 x16参考时钟)下,未打拍的tvalid路径slack为-0.8ns。

  2. tready反压必须可预测:用户逻辑的tready不能是随机脉冲。QDMA/RDMA引擎内部有深度为8的FIFO缓冲tdata,当FIFO满时自动拉低tvalid。但如果用户逻辑在tready=0期间仍持续驱动tdata,会导致数据错位。正确做法是:

    always @(posedge aclk) begin if (!tready) tdata <= '0; // 强制清零,避免毛刺 else tdata <= next_tdata; end
  3. TLAST必须精准标记包尾:对于视频流,tlast=1必须出现在每一帧最后一个像素的tdata上。若在MIPI CSI-2接收器中,tlast被错误置位在SOT(Start of Transmission)包头,则V4L2驱动会认为帧结束,后续数据全丢弃。我们通常在接收器状态机中,用行计数器+像素计数器联合判断TLAST时机。

3.2 8通道中断聚合:从16根MSI线到1个Linux IRQ的硬件归并

手册提到“多达16个输出到Host的用户中断信号”,但Linux内核通常只为一个PCIe设备分配1个IRQ号。若8个H2C通道各用1根MSI线,8个C2H通道再用8根,总共16根——内核根本无法处理。解决方案是硬件级中断聚合:

  • 所有H2C通道的完成中断(H2C_DONE[0:7])输入到一个8输入OR门,输出H2C_GLOBAL_IRQ;
  • 所有C2H通道的完成中断(C2H_DONE[0:7])输入到另一个8输入OR门,输出C2H_GLOBAL_IRQ;
  • H2C_GLOBAL_IRQ和C2H_GLOBAL_IRQ再经一个2输入OR门,最终接至PCIe IP的user_irq_req;
  • 在Linux驱动中,通过读取INT_STATUS寄存器(0x3000)的bit[15:0],可定位具体是哪个通道触发了中断。
// 驱动中断处理函数关键逻辑 static irqreturn_t qdma_irq_handler(int irq, void *dev_id) { u32 status = ioread32(base + 0x3000); if (status & 0x00FF) { // H2C通道0-7 for (int i = 0; i < 8; i++) { if (status & (1 << i)) handle_h2c_done(i); } } if (status & 0xFF00) { // C2H通道0-7(bit8-15) for (int i = 0; i < 8; i++) { if (status & (1 << (i+8))) handle_c2h_done(i); } } iowrite32(status, base + 0x3000); // 清中断 return IRQ_HANDLED; }

注意:INT_STATUS是写1清零(Write-One-to-Clear),不是写0。曾有团队在Xilinx ZynqMP上因误写iowrite32(0, base + 0x3000),导致中断永远无法清除,CPU被100%占满——这是真正的“后悔药”场景,必须写进设计checklist。

3.3 用户寄存器接口:16组32-bit向量信号的工程化封装

除了AXI4-Lite Master,手册还提供User Register接口,这是DMA引擎与用户逻辑的“神经末梢”。它不是标准总线,而是16组独立的32-bit向量信号(USER_REG_OUT[0:15][31:0])和对应的1-bit使能(USER_REG_EN[0:15])。典型用法:

  • USER_REG_OUT[0]:H2C通道0的当前描述符索引(0-31);
  • USER_REG_OUT[1]:C2H通道0的Ring BufferCONSUMER_IDX;
  • USER_REG_OUT[2]:全局错误码(bit0=H2C超时,bit1=C2H CRC错误...);
  • USER_REG_EN[0]:当H2C通道0完成一个描述符时,此信号拉高1个时钟周期。

这些信号必须用同步FIFO跨时钟域(PCIe时钟域→用户逻辑时钟域),否则会出现亚稳态。我们采用双时钟FIFO IP核,深度设为4,读写指针用格雷码编码——这是规避跨时钟域亚稳态的工业级做法,比用两级触发器可靠得多。

4. 常见问题排查:8个高频翻车点与对应解法

这套方案在实际部署中,有8个点几乎必然踩坑。不是技术不行,是文档没写透,或者参数组合太隐蔽。我把它们按“现象→原因→解法”列出来,全是某高校课程设计和某公司产品化过程中真实发生的案例。

4.1 现象:Linux下dmesg显示pcieport 0000:00:01.0: AER: Multiple Correctable error received: id=00e0,DMA吞吐只有理论值30%

原因:PCIe链路层发生大量Correctable Error,根源是Host端BIOS中Advanced > PCI Express > ASPM(Active State Power Management)被启用。ASPM会在空闲时降低PCIe链路电压/频率,但QDMA/RDMA引擎对链路稳定性极度敏感,微小的电压波动就会触发AER错误并降速。
解法:进入BIOS关闭ASPM,或Linux启动参数加pcie_aspm=off。实测关闭后,PCIe 3.0 x16吞吐从4.2GB/s回升至14.1GB/s。

4.2 现象:V4L2应用调用VIDIOC_STREAMON后立即返回-EBUSY,/dev/video0无法打开

原因:V4L2驱动要求设备在streamon前,必须已完成至少一个C2H Ring Buffer Slot的初始化。但学生常忘记在open()后、streamon前,调用ioctl(fd, VIDIOC_REQBUFS, &req)申请缓冲区,并用mmap()映射内存。驱动检测到RING_BASE_ADDR为0,直接拒绝启动。
解法:严格按V4L2流程:open→VIDIOC_REQBUFS→VIDIOC_QUERYBUF→mmap→VIDIOC_QBUF(至少2次)→VIDIOC_STREAMON。少一步,必报错。

4.3 现象:8路MIPI摄像头同时接入,其中3路图像正常,5路严重花屏或全黑

原因:MIPI PHY的Lane速率不一致。手册要求所有8路MIPI必须使用相同lane_clk(如800MHz),但某开发板上,3路走主时钟树,5路走次级时钟树,相位偏差超2ns,导致HS(High-Speed)模式下采样失败。
解法:用ILA抓取mipi_clk和mipi_data眼图,确认所有Lane的clk边沿对齐误差<0.5ns。若不满足,必须在PCB Layout阶段将8路MIPI时钟走等长线,或在FPGA内用MMCM做相位校准。

4.4 现象:PCIe 2.0 x4模式下,H2C DMA效率仅65%,远低于标称的90%

原因:Max Payload Size(MPS)与Max Read Request Size(MRRS)不匹配。PCIe 2.0规范中,MRRS必须≤MPS,但手册推荐MPS=256B、MRRS=512B——这在PCIe 2.0下非法!合法组合只有MPS=MRRS=128B或256B。
解法:修改Host端PCIe配置空间,将MRRS设为与MPS相同值。用setpci -s 00:01.0 68.w=0200(设MRRS=256B)后,效率升至89.7%。

4.5 现象:FPGA烧录后,lspci -vvv能看到设备,但cat /proc/interrupts中无对应IRQ号

原因:PCIe设备的Interrupt Pin寄存器(配置空间0x3C)被硬编码为0(No Interrupt),而实际硬件连接了INTA#。Xilinx PCIe IP默认不使能MSI,需在IP GUI中勾选Enable MSI,并设置Number of MSI Vectors≥1。
解法:重新生成PCIe IP,确保Enable MSI打钩,且MSI Vector Count≥16(覆盖8H2C+8C2H)。生成后,在Vivado中检查pcie_0_i/inst/pcie_support/pcie_support_i/msi_enable_reg是否为1。

4.6 现象:AXI4-Stream接口tlast信号在视频帧末尾出现多个脉冲,导致V4L2驱动解析出错帧

原因:tlast生成逻辑未考虑MIPI CSI-2的ECC/HEC包结构。MIPI协议中,一帧图像末尾有End of Transmission(EOT)包,若tlast在EOT包内置位,会被误判为帧结束。
解法:在MIPI接收器中,用状态机识别EOT包(0x00000000),并在EOT之后第3个pixel_clk周期置位tlast,确保其严格位于帧数据边界。

4.7 现象:dma_alloc_coherent分配的内存,DMA传输后Host端读取数据全为0

原因:ARM架构(如ZynqMP)中,dma_alloc_coherent分配的内存位于Non-cacheable区域,但某些Linux BSP版本存在DMA一致性bug,需手动调用__dma_sync()。
解法:在DMA完成中断中,添加缓存同步:

dma_sync_single_for_cpu(dev, dma_handle, size, DMA_FROM_DEVICE); // 处理数据 dma_sync_single_for_device(dev, dma_handle, size, DMA_FROM_DEVICE);

4.8 现象:8通道全开时,FPGA温度飙升至95°C,板卡自动断电

原因:8个DMA引擎全速运行时,BRAM读写功耗激增。查表1可知,PCIe 3.0 x16 8通道方案用142个BRAM,而BRAM静态功耗占总功耗40%。散热设计不足导致热失控。
解法:在Vivado中启用Power Optimization,将DMA描述符RAM改为Block RAM而非Distributed RAM(后者功耗更高);PCB上为BRAM区域增加2oz铜厚+导热硅脂+散热片。实测温度降至72°C。

5. 验收与答辩:用三张表、一个脚本、一次真机演示征服评审

交毕设/课设,不是交代码,是交一份能让评审老师当场点头的可信证据链。我带过三届学生,总结出最有效的验收方法:用三张表锁定技术细节,用一个自动化脚本证明功能完备,用一次真机演示暴露真实瓶颈。下面就是你答辩时可以直接复用的全套动作。

5.1 表格1:8通道性能实测对比表(必须手填,禁用理论值)

这张表是答辩PPT第一页的核心。不要抄手册里的“>14GB/s”,要填你板子上实测的数据。用dd+time测裸带宽,用v4l2-ctl测视频流帧率:

通道类型链路配置理论带宽实测带宽(dd)实测帧率(8路1080p)抖动(us)备注
H2CPCIe 3.0 x1614.0 GB/s13.8 GB/s59.9 fps420±85使用dma_alloc_coherent
C2HPCIe 3.0 x1614.0 GB/s13.6 GB/s59.7 fps380±72启用Ring Buffer预取
H2CPCIe 2.0 x41.7 GB/s1.65 GB/s——仅单通道测试

提示:dd命令必须用oflag=direct绕过Page Cache:
dd if=/dev/zero of=/dev/your_dma_device bs=1M count=1000 oflag=direct
测完立刻sync,否则数据还在Buffer中。某同学没加oflag=direct,测出22GB/s,答辩时被问“怎么超PCIe理论值”,当场哑火。

5.2 表格2:资源占用与约束满足表(Vivado截图+手写标注)

评审老师最信硬件实测数据。这张表必须附Vivado的Report Utilization截图,并在旁边手写标注关键项:

资源类型8通道实测单通道实测是否满足依据
LUTs5342422107是表1/表5,余量32%
FFs9535646116是表1/表5,余量28%
BRAM14230是表1/表5,余量15%
PCIe Block11是Xilinx UG578规定单Block最多支持x16

注意:截图必须包含Timing Summary中的WNS(Worst Negative Slack),必须>0。若为-0.1ns,哪怕功能正常,也会被质疑时序风险。我们通常在xdc中加set_max_delay -from [get_ports h2c_tvalid] -to [get_ports h2c_tready] 2.0强制约束。

5.3 表格3:Linux驱动兼容性验证表(覆盖主流内核)

学生最容易栽在驱动适配上。这张表证明你的驱动不是“只在我电脑上能跑”:

内核版本发行版V4L2测试中断测试DMA吞吐问题及修复
5.4.0Ubuntu 20.04✅✅✅无
5.10.0Debian 11✅✅✅无
6.1.0Ubuntu 22.04⚠️✅✅struct v4l2_buffer字段变更,已patch
6.6.0Arch Linux❌✅✅videobuf2-coreAPI重构,待适配

提示:6.6.0的问题不用当场解决,但必须写明“已定位为vb2_core_qbuf函数签名变更”,并给出补丁链接(GitHub gist即可)。这比说“还没测”专业十倍。

5.4 自动化验收脚本:validate_qdma.sh(答辩时现场运行)

把以下脚本保存为validate_qdma.sh,答辩时用bash validate_qdma.sh运行,全程3分钟,所有结果自动生成报告:

#!/bin/bash echo "=== QDMA/RDMA Subsystem 验收脚本 ===" echo "1. 检查设备识别..." lspci | grep -i "qdma\|rdma" || { echo "❌ 设备未识别"; exit 1; } echo "2. 检查中断注册..." grep "qdma" /proc/interrupts | wc -l | grep -q "1$" || { echo "❌ 中断未注册"; exit 1; } echo "3. 测试H2C DMA带宽..." dd if=/dev/zero of=/dev/qdma_h2c bs=1M count=500 oflag=direct 2>&1 | grep "bytes" | awk '{print $1}' | sed 's/,//' echo "4. 测试C2H DMA带宽..." dd if=/dev/qdma_c2h of=/dev/null bs=1M count=500 iflag=direct 2>&1 | grep "bytes" | awk '{print $1}' | sed 's/,//' echo "5. 检查V4L2设备..." v4l2-ctl --list-devices | grep -q "qdma" || { echo "❌ V4L2设备未注册"; exit 1; } echo "✅ 全部通过!生成报告..." echo "$(date): $(hostname)" > validation_report.txt echo "H2C Bandwidth: $(dd ...)" >> validation_report.txt echo "C2H Bandwidth: $(dd ...)" >> validation_report.txt echo "Report saved to validation_report.txt"

5.5 真机演示技巧:用“故障注入”展示系统鲁棒性

别只演示“一切正常”。评审老师想看的是:你懂不懂系统边界。现场演示时,主动做两件事:

  • 拔掉一路MIPI线缆:观察V4L2是否自动切换到-ENODEV错误处理,剩余7路是否继续稳定输出;
  • 在/sys/class/qdma/下写0到channel_reset:验证单通道软复位是否不影响其他通道。

这比演示10分钟流畅视频更有说服力。从那以后我每次带学生答辩,都强制他们先做5分钟故障注入测试,再开始正式演示——因为真正的工程能力,不在顺境,而在破局。

希望帮到你。

本文还有配套的精品资源,点击获取

版权声明: 本文来自互联网用户投稿,该文观点仅代表作者本人,不代表本站立场。本站仅提供信息存储空间服务,不拥有所有权,不承担相关法律责任。如若内容造成侵权/违法违规/事实不符,请联系邮箱:809451989@qq.com进行投诉反馈,一经查实,立即删除!
网站建设 2026/11/3 21:10:07

大数据降维技术:7种核心方法与应用场景解析

1. 大数据预处理中的降维技术概述 在大数据时代&#xff0c;我们每天面对的数据量呈现爆炸式增长。作为一名数据工程师&#xff0c;我经常遇到这样的场景&#xff1a;客户兴奋地告诉我他们收集了几百万条用户行为数据&#xff0c;但打开数据集一看&#xff0c;上千个特征列让建…

作者头像 李华
网站建设 2026/11/3 21:06:15

OpenCode Token监控实战:从日志解析到实时速度与缓存命中率

自从 OpenCode 升到 V2 之后&#xff0c;我在终端里写代码越来越依赖它&#xff0c;但很快就发现一个问题&#xff1a;我根本不知道自己这半天到底烧了多少 Token。OpenCode 原生界面里没有实时的 Token 速度、没有成本估算&#xff0c;连上下文缓存命中率这种直接影响结算的指…

作者头像 李华
网站建设 2026/11/3 21:05:03

MTBF计算书深度拆解:失效率累加模型与π系数修正机制

简介&#xff1a;这份MTBF计算书面向可靠性工程师、硬件设计人员及电子产品质量评估学习者&#xff0c;以金属膜电阻器为切入点&#xff0c;完整演示平均故障间隔时间的计算流程。内容围绕失效率公式λpλbπEπCVπQ展开&#xff0c;逐项列出各型号电阻的基本失效率、环境系数…

作者头像 李华
网站建设 2026/11/3 21:04:11

Oracle AI Database 26ai本地部署版核心技术解析与应用实践

1. Oracle AI Database 26ai本地服务器版发布背景作为一名数据库行业从业者&#xff0c;我清楚地记得三年前Oracle首次发布AI Database概念时的场景。当时Oracle在OpenWorld大会上展示的AI与数据库融合的愿景&#xff0c;让整个行业为之震动。而今天&#xff0c;我们终于迎来了…

作者头像 李华
网站建设 2026/11/3 21:02:53

Paperclip:面向AI Agent的Node.js+React轻量运行时框架

1. 项目概述&#xff1a;Paperclip 不是回形针&#xff0c;而是一个面向 AI Agent 开发的轻量级 Node.js 运行时框架你搜“paperclip”时&#xff0c;第一反应可能是办公桌抽屉里那枚银色小金属件——但最近在掘金、GitHub 和 React 前端技术群聊里&#xff0c;“Paperclip”正…

作者头像 李华
网站建设 2026/11/3 21:02:31

把后见之明变成系统能力:三层拆解法的复盘方法论

接手上一个项目复盘会的时候&#xff0c;我盯着白板上那句“下次一定要提前确认接口联调时间”&#xff0c;突然意识到一个扎心的事实&#xff1a;这句话我们上上个项目就在写&#xff0c;但这次依然踩了同一个坑。不是大家不想改&#xff0c;而是“事后看明白”这件事本身&…

作者头像 李华